{"text_format":"1","workbook":"xlsx","n_sheets":7,"sheets":["Etusivu","Lähtötiedot","Vertailu","Toimenpiteiden valitseminen","Yhteenveto valinnoista","Kuvaajat","Temp"],"not_rendered":{"charts":4,"images":59,"macros":1,"external_links":0,"defined_names":3,"comments":0,"pivot_tables":0},"unopened":[],"bounds":{"document_bytes":16777216,"sheet_cells":100000,"rows_first":2000,"rows_last":500,"rows_between":2000,"halvings":0,"cell_chars":16384,"cell_head_chars":4096},"cells_cut":0,"cells_raw":0,"read":"whole","date_system":"1900"}

{"sheet":"Etusivu","index":0,"n_rows":49,"n_cols":4,"rows_kept":49,"cut":false,"hidden":false,"merged":[[5,1,5,10],[4,1,4,10],[1,1,1,10],[0,1,0,10],[2,1,2,10],[3,1,3,10]]}
[null,"KERROSTALOJEN KORJAUSTOIMINNAN"]
[null,"ENERGIATALOUDELLISTEN VALINTOJEN VERTAILU"]
[null,"Rakenne- ja LVIS-teknisten energiansäästötoimenpiteiden"]
[null,"valinta rakenne- ja laitetasolla"]
[]
[null,"Tekijä: Antti Kurvinen | Tampereen teknillinen yliopisto | Rakennusteknikkan laitos | RTT"]
[]
[]
[]
[]
[]
[]
[]
[]
[]
{"$rows_left_out":35}
{"sheet":"Lähtötiedot","index":1,"n_rows":61,"n_cols":12,"rows_kept":61,"cut":false,"hidden":false,"merged":[[5,8,5,12],[12,5,12,6],[0,1,0,12],[44,4,45,4],[44,5,45,5],[44,6,45,6],[44,8,45,8],[35,5,36,5],[35,6,36,6],[35,8,36,8],[42,4,43,4],[42,5,43,5],[42,6,43,6],[42,8,43,8],[39,2,39,8],[35,7,36,7],[4,2,4,3],[8,2,9,2],[55,2,55,8],[31,4,32,4],[31,5,32,5],[31,6,32,6],[31,8,32,8],[33,4,34,4],[33,5,34,5],[33,6,34,6],[33,8,34,8],[42,2,43,2],[44,2,45,2],[46,2,47,2],[46,4,47,4],[46,5,47,5],[46,8,47,8],[50,2,50,8],[20,2,21,2],[42,7,43,7],[7,3,7,6],[22,8,23,8],[20,7,21,7],[22,7,23,7],[44,7,45,7],[46,7,47,7],[46,6,47,6],[31,7,32,7],[33,7,34,7],[12,8,12,9],[6,3,6,6],[8,3,9,6],[33,2,34,2],[35,2,36,2],[35,4,36,4],[22,4,23,4],[22,5,23,5],[22,6,23,6],[13,11,13,12],[20,8,21,8],[24,2,25,2],[31,2,32,2],[28,2,28,8],[17,2,17,8],[24,7,25,7],[13,8,13,9],[20,4,21,4],[20,5,21,5],[20,6,21,6],[22,2,23,2],[24,4,25,4],[24,8,25,8],[24,5,25,5],[24,6,25,6],[6,8,6,9],[6,11,6,12],[7,8,7,9],[7,11,7,12],[8,8,8,9],[8,11,8,12],[12,11,12,12],[9,8,9,9],[9,11,9,12],[10,8,10,9],[10,11,10,12],[11,8,11,9],[11,10,11,12]]}
[]
[null,null,"KERROSTALOJEN KORJAUSTOIMINNAN ENERGIATALOUDELLISTEN VALINTOJEN VERTAILU"]
[null,null,null,null,"Rakenne- ja LVIS-teknisten energiansäästötoimenpiteiden valinta rakenne- ja laitetasolla"]
[]
[null,null,"Kohteen lähtötiedot"]
[null,null,null,null,null,null,null,null,"LÄHTÖTIEDOT ENNEN REMONTTIA"]
[null,null,"Laatija","Antti Kurvinen",null,null,null,null,"Laskentakorko",null,0.05]
[null,null,"Päivämäärä",{"$f":"TODAY()","v":"2010-07-29"},null,null,null,null,"Bruttopinta-ala [brm2]",null,5468,"m2"]
[null,null,"Hankkeen nimi","SUREURO pilot: Kitiniitynkatu 2",null,null,null,null,"Asuntopinta-ala [hum2]",null,3284,"m2"]
[null,null,null,null,null,null,null,null,"Normeerattu\nenergiankulutus\nennen korjausta",null,1179,"MWh"]
[null,null,null,null,null,null,null,null,"ET-luku ennen korjausta",null,{"$f":"IF(K10=\"\",\"\",(K10*1000)/K8)","v":215.61814191660571},"kWh/brm2/vuosi"]
[null,null,null,null,null,null,null,null,"ET-luokka\nennen korjausta",null,{"$f":"IF(K11=\"\",\"\",IF(K11<=100,\"A\",IF(K11<=120,\"B\",IF(K11<=140,\"C\",IF(K11<=180,\"D\",IF(K11<=230,\"E\",IF(K11<=280,\"F\",\"G\")))))))","v":"E"}]
[null,null,null,null,null,"PINTA-ALATIEDOT REMONTIN JÄLKEEN",null,null,"Lämmitysenergian hinta",null,50,"€/MWh"]
[null,null,null,null,null,"Brutto-ala [brm2]",7236,null,"Sähköenergian hinta",null,70,"€/MWh"]
[null,null,null,null,null,"Asuntopinta-ala [hum2]",4645]
{"$rows_left_out":47}
{"sheet":"Vertailu","index":2,"n_rows":94,"n_cols":12,"rows_kept":94,"cut":false,"hidden":false,"merged":[[0,1,0,13],[1,12,1,13],[2,12,2,13],[4,2,4,5],[74,2,74,11],[52,2,52,11],[30,2,30,11],[8,2,8,11]]}
[]
[null,null,"KERROSTALOJEN KORJAUSTOIMINNAN ENERGIATALOUDELLISTEN VALINTOJEN VERTAILU"]
[null,null,null,null,null,"Rakenne- ja LVIS-teknisten energiansäästötoimenpiteiden valinta rakenne- ja laitetasolla"]
[]
[null,null,"Energiansäästötoimenpiteiden vertailu"]
[]
[]
[]
[null,null,"VALINTAJÄRJESTYS JÄRJESTETTYNÄ SISÄISEN KORON MUKAAN"]
[]
[null,null,"VALINTA-\nJÄRJESTYS","SISÄINEN\nKORKO","TOIMENPITEEN\nTUNNUS","KUSTANNUSTEN\nMUUTOS\n[€]","LÄMMITYSENERGIAN \nKULUTUKSEN\nMUUTOS [MWh/a]","SÄHKÖENERGIAN\nKULUTUKSEN\nMUUTOS [MWh/a]","VUOSITTAINEN\nKOKONAIS-\nENERGIANSÄÄSTÖ\n[MWh/a]","KUSTANNUSTEN VUOSIMUUTOS\n[€/a]","PITOAIKA\n[a]","KUSTANNUS /\nENERGIANSÄÄSTÖ\n[€/(kWh/a)]"]
[null,null,{"$f":"IF(ISNA(VLOOKUP(1,'Toimenpiteiden valitseminen'!$D$21:$O$50,1,FALSE)),\"\",VLOOKUP(1,'Toimenpiteiden valitseminen'!$D$21:$O$50,1,FALSE))","v":1},{"$f":"IF(ISNA(VLOOKUP(1,'Toimenpiteiden valitseminen'!$D$21:$O$50,3,FALSE)),\"\",VLOOKUP(1,'Toimenpiteiden valitseminen'!$D$21:$O$50,3,FALSE))","v":0.23089228481829616},{"$f":"IF(ISNA(VLOOKUP(1,'Toimenpiteiden valitseminen'!$D$21:$O$50,4,FALSE)),\"\",VLOOKUP(1,'Toimenpiteiden valitseminen'!$D$21:$O$50,4,FALSE))","v":"VKM"},{"$f":"IF(ISNA(VLOOKUP(1,'Toimenpiteiden valitseminen'!$D$21:$O$50,6,FALSE)),\"\",VLOOKUP(1,'Toimenpiteiden valitseminen'!$D$21:$O$50,6,FALSE))","v":46800},{"$f":"IF(ISNA(VLOOKUP(1,'Toimenpiteiden valitseminen'!$D$21:$O$50,7,FALSE)),\"\",VLOOKUP(1,'Toimenpiteiden valitseminen'!$D$21:$O$50,7,FALSE))","v":-29},{"$f":"IF(ISNA(VLOOKUP(1,'Toimenpiteiden valitseminen'!$D$21:$O$50,8,FALSE)),\"\",VLOOKUP(1,'Toimenpiteiden valitseminen'!$D$21:$O$50,8,FALSE))","v":0},{"$f":"IF(AND(G12=\"\",H12=\"\"),\"\",-(G12+H12))","v":29},{"$f":"IF(ISNA(VLOOKUP(1,'Toimenpiteiden valitseminen'!$D$21:$O$50,9,FALSE)),\"\",VLOOKUP(1,'Toimenpiteiden valitseminen'!$D$21:$O$50,9,FALSE))","v":-11307},{"$f":"IF(ISNA(VLOOKUP(1,'Toimenpiteiden valitseminen'!$D$21:$O$50,10,FALSE)),\"\",VLOOKUP(1,'Toimenpiteiden valitseminen'!$D$21:$O$50,10,FALSE))","v":15},{"$f":"IF(AND(G12=\"\",H12=\"\"),\"\",F12/(1000*I12))","v":1.6137931034482758}]
[null,null,{"$f":"IF(ISNA(VLOOKUP(2,'Toimenpiteiden valitseminen'!$D$21:$O$50,1,FALSE)),\"\",VLOOKUP(2,'Toimenpiteiden valitseminen'!$D$21:$O$50,1,FALSE))","v":2},{"$f":"IF(ISNA(VLOOKUP(2,'Toimenpiteiden valitseminen'!$D$21:$O$50,3,FALSE)),\"\",VLOOKUP(2,'Toimenpiteiden valitseminen'!$D$21:$O$50,3,FALSE))","v":0.20628414639059262},{"$f":"IF(ISNA(VLOOKUP(2,'Toimenpiteiden valitseminen'!$D$21:$O$50,4,FALSE)),\"\",VLOOKUP(2,'Toimenpiteiden valitseminen'!$D$21:$O$50,4,FALSE))","v":"IKK2"},{"$f":"IF(ISNA(VLOOKUP(2,'Toimenpiteiden valitseminen'!$D$21:$O$50,6,FALSE)),\"\",VLOOKUP(2,'Toimenpiteiden valitseminen'!$D$21:$O$50,6,FALSE))","v":10868},{"$f":"IF(ISNA(VLOOKUP(2,'Toimenpiteiden valitseminen'!$D$21:$O$50,7,FALSE)),\"\",VLOOKUP(2,'Toimenpiteiden valitseminen'!$D$21:$O$50,7,FALSE))","v":-45},{"$f":"IF(ISNA(VLOOKUP(2,'Toimenpiteiden valitseminen'!$D$21:$O$50,8,FALSE)),\"\",VLOOKUP(2,'Toimenpiteiden valitseminen'!$D$21:$O$50,8,FALSE))","v":0},{"$f":"IF(AND(G13=\"\",H13=\"\"),\"\",-(G13+H13))","v":45},{"$f":"IF(ISNA(VLOOKUP(2,'Toimenpiteiden valitseminen'!$D$21:$O$50,9,FALSE)),\"\",VLOOKUP(2,'Toimenpiteiden valitseminen'!$D$21:$O$50,9,FALSE))","v":-2250},{"$f":"IF(ISNA(VLOOKUP(2,'Toimenpiteiden valitseminen'!$D$21:$O$50,10,FALSE)),\"\",VLOOKUP(2,'Toimenpiteiden valitseminen'!$D$21:$O$50,10,FALSE))","v":30},{"$f":"IF(AND(G13=\"\",H13=\"\"),\"\",F13/(1000*I13))","v":0.24151111111111112}]
[null,null,{"$f":"IF(ISNA(VLOOKUP(3,'Toimenpiteiden valitseminen'!$D$21:$O$50,1,FALSE)),\"\",VLOOKUP(3,'Toimenpiteiden valitseminen'!$D$21:$O$50,1,FALSE))","v":3},{"$f":"IF(ISNA(VLOOKUP(3,'Toimenpiteiden valitseminen'!$D$21:$O$50,3,FALSE)),\"\",VLOOKUP(3,'Toimenpiteiden valitseminen'!$D$21:$O$50,3,FALSE))","v":0.18220341625823658},{"$f":"IF(ISNA(VLOOKUP(3,'Toimenpiteiden valitseminen'!$D$21:$O$50,4,FALSE)),\"\",VLOOKUP(3,'Toimenpiteiden valitseminen'!$D$21:$O$50,4,FALSE))","v":"IKK1"},{"$f":"IF(ISNA(VLOOKUP(3,'Toimenpiteiden valitseminen'!$D$21:$O$50,6,FALSE)),\"\",VLOOKUP(3,'Toimenpiteiden valitseminen'!$D$21:$O$50,6,FALSE))","v":12540},{"$f":"IF(ISNA(VLOOKUP(3,'Toimenpiteiden valitseminen'!$D$21:$O$50,7,FALSE)),\"\",VLOOKUP(3,'Toimenpiteiden valitseminen'!$D$21:$O$50,7,FALSE))","v":-46},{"$f":"IF(ISNA(VLOOKUP(3,'Toimenpiteiden valitseminen'!$D$21:$O$50,8,FALSE)),\"\",VLOOKUP(3,'Toimenpiteiden valitseminen'!$D$21:$O$50,8,FALSE))","v":0},{"$f":"IF(AND(G14=\"\",H14=\"\"),\"\",-(G14+H14))","v":46},{"$f":"IF(ISNA(VLOOKUP(3,'Toimenpiteiden valitseminen'!$D$21:$O$50,9,FALSE)),\"\",VLOOKUP(3,'Toimenpiteiden valitseminen'!$D$21:$O$50,9,FALSE))","v":-2300},{"$f":"IF(ISNA(VLOOKUP(3,'Toimenpiteiden valitseminen'!$D$21:$O$50,10,FALSE)),\"\",VLOOKUP(3,'Toimenpiteiden valitseminen'!$D$21:$O$50,10,FALSE))","v":30},0.27260869565217394]
[null,null,{"$f":"IF(ISNA(VLOOKUP(4,'Toimenpiteiden valitseminen'!$D$21:$O$50,1,FALSE)),\"\",VLOOKUP(4,'Toimenpiteiden valitseminen'!$D$21:$O$50,1,FALSE))","v":4},{"$f":"IF(ISNA(VLOOKUP(4,'Toimenpiteiden valitseminen'!$D$21:$O$50,3,FALSE)),\"\",VLOOKUP(4,'Toimenpiteiden valitseminen'!$D$21:$O$50,3,FALSE))","v":0.11255324685591461},{"$f":"IF(ISNA(VLOOKUP(4,'Toimenpiteiden valitseminen'!$D$21:$O$50,4,FALSE)),\"\",VLOOKUP(4,'Toimenpiteiden valitseminen'!$D$21:$O$50,4,FALSE))","v":"YP1"},{"$f":"IF(ISNA(VLOOKUP(4,'Toimenpiteiden valitseminen'!$D$21:$O$50,6,FALSE)),\"\",VLOOKUP(4,'Toimenpiteiden valitseminen'!$D$21:$O$50,6,FALSE))","v":2628},{"$f":"IF(ISNA(VLOOKUP(4,'Toimenpiteiden valitseminen'!$D$21:$O$50,7,FALSE)),\"\",VLOOKUP(4,'Toimenpiteiden valitseminen'!$D$21:$O$50,7,FALSE))","v":-6},{"$f":"IF(ISNA(VLOOKUP(4,'Toimenpiteiden valitseminen'!$D$21:$O$50,8,FALSE)),\"\",VLOOKUP(4,'Toimenpiteiden valitseminen'!$D$21:$O$50,8,FALSE))","v":0},6,{"$f":"IF(ISNA(VLOOKUP(4,'Toimenpiteiden valitseminen'!$D$21:$O$50,9,FALSE)),\"\",VLOOKUP(4,'Toimenpiteiden valitseminen'!$D$21:$O$50,9,FALSE))","v":-300},{"$f":"IF(ISNA(VLOOKUP(4,'Toimenpiteiden valitseminen'!$D$21:$O$50,10,FALSE)),\"\",VLOOKUP(4,'Toimenpiteiden valitseminen'!$D$21:$O$50,10,FALSE))","v":40},0.438]
{"$rows_left_out":80}
{"sheet":"Toimenpiteiden valitseminen","index":3,"n_rows":64,"n_cols":15,"rows_kept":64,"cut":false,"hidden":false,"merged":[[4,2,4,7],[7,2,7,3],[8,2,8,3],[9,2,9,3],[10,2,10,3],[11,2,11,3],[12,2,12,3],[13,2,13,3],[0,1,0,14],[1,12,1,14],[2,12,2,14],[6,8,6,9],[7,5,7,6],[8,5,8,6],[9,5,9,6],[10,5,10,6],[11,5,11,6],[7,11,7,12],[8,11,8,12],[12,13,12,14],[10,11,10,12],[12,11,12,12],[13,11,13,12],[12,4,12,6],[39,6,40,6],[31,3,32,3],[33,3,34,3],[29,4,30,4],[31,2,32,2],[14,5,14,6],[19,1,19,14],[21,2,22,2],[23,2,24,2],[23,5,24,5],[14,11,14,12],[17,7,18,7],[17,8,18,8],[21,1,22,1],[23,1,24,1],[21,12,22,12],[37,6,38,6],[21,6,22,6],[23,6,24,6],[25,6,26,6],[29,6,30,6],[21,4,22,4],[23,4,24,4],[14,2,14,3],[31,11,32,11],[41,6,42,6],[17,11,18,11],[17,12,18,12],[35,1,35,14],[17,9,18,9],[17,10,18,10],[29,14,30,14],[31,13,32,13],[31,14,32,14],[25,8,26,8],[25,9,26,9],[25,10,26,10],[25,11,26,11],[25,13,26,13],[29,13,30,13],[17,13,18,13],[25,14,26,14],[17,14,18,14],[17,1,17,3],[17,4,18,4],[17,5,18,5],[17,6,18,6],[29,5,30,5],[29,1,30,1],[29,11,30,11],[37,3,38,3],[39,3,40,3],[41,3,42,3],[31,12,32,12],[33,12,34,12],[37,12,38,12],[39,12,40,12],[31,5,32,5],[37,5,38,5],[39,5,40,5],[33,4,34,4],[41,5,42,5],[41,4,42,4],[37,4,38,4],[39,4,40,4],[33,5,34,5],[31,6,32,6],[33,6,34,6],[31,4,32,4],[31,8,32,8],[31,9,32,9],[31,10,32,10],[23,14,24,14],[31,1,32,1],[21,3,22,3],[23,3,24,3],[25,3,26,3],[29,3,30,3],[29,12,30,12],[25,4,26,4],[9,11,9,12],[11,11,11,12],[25,1,26,1],[23,12,24,12],[25,12,26,12],[21,5,22,5],[21,9,22,9],[21,10,22,10],[21,11,22,11],[29,8,30,8],[29,9,30,9],[29,10,30,10],[25,5,26,5],[27,1,27,14],[25,2,26,2],[29,2,30,2],[13,5,13,6],[41,11,42,11],[41,13,42,13],[37,14,38,14],[39,8,40,8],[39,9,40,9],[39,10,40,10],[39,11,40,11],[39,13,40,13],[39,14,40,14],[37,8,38,8],[37,13,38,13],[37,9,38,9],[37,10,38,10],[37,11,38,11],[41,12,42,12],[21,13,22,13],[21,14,22,14],[21,8,22,8],[23,8,24,8],[23,9,24,9],[23,10,24,10],[23,11,24,11],[23,13,24,13],[43,1,43,14],[45,1,45,14],[50,1,50,14],[51,1,51,14],[52,12,52,14],[52,1,52,7],[33,2,34,2],[37,2,38,2],[39,2,40,2],[41,2,42,2],[41,1,42,1],[33,1,34,1],[37,1,38,1],[39,1,40,1],[41,14,42,14],[33,8,34,8],[33,9,34,9],[33,10,34,10],[33,11,34,11],[33,13,34,13],[33,14,34,14],[41,8,42,8],[41,9,42,9],[41,10,42,10]]}
[]
[null,null,"KERROSTALOJEN KORJAUSTOIMINNAN ENERGIATALOUDELLISTEN VALINTOJEN VERTAILU"]
[null,null,null,null,null,"Rakenne- ja LVIS-teknisten energiansäästötoimenpiteiden valinta rakenne- ja laitetasolla"]
[]
[null,null,"Energiansäästötoimenpiteiden valitseminen"]
[]
[null,null,null,null,null,null,null,null,"PAREMPIIN ET-LUOKKIIN PÄÄSEMIKSEKSI\nTARVITTAVA ENERGIANSÄÄSTÖ\nENNEN VALINTOJA"]
[null,null,"Laskentakorko",null,{"$f":"Lähtötiedot!K7","v":0.05},null,null,null,"ET-LUOKKA","TARVITTAVA\nENERGIANSÄÄSTÖ\n[MWh]",null,"Bruttopinta-ala\n[brm2]",null,{"$f":"Lähtötiedot!G14","v":7236},"m2"]
[null,null,"Bruttopinta-ala\n[brm2]",null,{"$f":"Lähtötiedot!K8","v":5468},"m2",null,null,"A",{"$f":"IF(E12<=100,\"NYKYINEN ET-LUOKKA\",((100-$E$12)*$N$8)/1000)","v":-836.61287490855887},null,"Asuntopinta-ala\n[hum2]",null,{"$f":"Lähtötiedot!G15","v":4645},"m2"]
[null,null,"Asuntopinta-ala\n[hum2]",null,{"$f":"Lähtötiedot!K9","v":3284},"m2",null,null,"B",{"$f":"IF(AND($E$12>=101,$E$12<=120),\"NYKYINEN ET-LUOKKA\",IF($E$12>120,(((120-$E$12)*$N$8)/1000),\"\"))","v":-691.89287490855895},null,"Valintojen kokonaiskustannukset\n(hum2)",null,{"$f":"IF(I53=\"\",\"\",I53)","v":1142444},"€"]
[null,null,"Normeerattu\nenergiankulutus\nennen korjausta",null,{"$f":"Lähtötiedot!K10","v":1179},"MWh",null,null,"C",{"$f":"IF(AND($E$12>=121,$E$12<=140),\"NYKYINEN ET-LUOKKA\",IF($E$12>140,(((140-$E$12)*$N$8)/1000),\"\"))","v":-547.17287490855892},null,"Normeerattu\nenergiankulutus\nvalintojen jälkeen",null,{"$f":"((E12*Lähtötiedot!G14)/1000)+(J53+K53)","v":978.81287490855891},"MWh"]
[null,null,"ET-luku ennen korjausta",null,{"$f":"IF(E11=\"\",\"\",(E11*1000)/E9)","v":215.61814191660571},"kWh/brm2/vuosi",null,null,"D",{"$f":"IF(AND($E$12>=141,$E$12<=180),\"NYKYINEN ET-LUOKKA\",IF($E$12>180,(((180-$E$12)*$N$8)/1000),\"\"))","v":-257.73287490855893},null,"ET-luku\nvalintojen jälkeen",null,{"$f":"IF(N11=\"\",\"\",(N11*1000)/N8)","v":135.26988321013803},"kWh/brm2/a"]
[null,null,"ET-luokka\nennen korjausta",null,{"$f":"IF(E12=\"\",\"\",IF(E12<=100,\"A\",IF(E12<=120,\"B\",IF(E12<=140,\"C\",IF(E12<=180,\"D\",IF(E12<=230,\"E\",IF(E12<=280,\"F\",\"G\")))))))","v":"E"},null,null,null,"E",{"$f":"IF(AND($E$12>=181,$E$12<=230),\"NYKYINEN ET-LUOKKA\",IF($E$12>230,(((230-$E$12)*$N$8)/1000),\"\"))","v":"NYKYINEN ET-LUOKKA"},null,"ET-luokka\nvalintojen jälkeen",null,{"$f":"IF(N12=\"\",\"\",IF(N12<=100,\"A\",IF(N12<=120,\"B\",IF(N12<=140,\"C\",IF(N12<=180,\"D\",IF(N12<=230,\"E\",IF(N12<=280,\"F\",\"G\")))))))","v":"C"}]
[null,null,"Lämmitysenergian\nhinta",null,{"$f":"Lähtötiedot!K13","v":50},"€/MWh",null,null,"F",{"$f":"IF(AND($E$12>=231,$E$12<=280),\"NYKYINEN ET-LUOKKA\",IF($E$12>280,(((280-$E$12)*$N$8)/1000),\"\"))","v":""},null,"Kokonaisenergiankulutuksen\nmuutos\nhinta",null,{"$f":"IF(AND(J53=\"\",K53=\"\"),\"\",J53+K53)","v":-581.4},"MWh/a"]
[null,null,"Sähköenergian\nhinta",null,{"$f":"Lähtötiedot!K14","v":70},"€/MWh",null,null,"G",{"$f":"IF($E$12>=281,\"NYKYINEN ET-LUOKKA\",\"\")","v":""},null,"Kustannusten\nvuosimuutos",null,{"$f":"IF(L53=\"\",\"\",L53)","v":-36195},"€/a"]
{"$rows_left_out":50}
{"sheet":"Yhteenveto valinnoista","index":4,"n_rows":68,"n_cols":14,"rows_kept":68,"cut":false,"hidden":false,"merged":[[2,12,2,13],[56,2,56,3],[57,2,57,3],[58,2,58,3],[27,1,27,13],[28,1,28,6],[28,11,28,13],[29,1,29,13],[47,2,47,3],[48,2,48,3],[53,2,53,3],[54,2,54,3],[55,2,55,3],[47,9,47,10],[48,9,48,10],[43,9,43,10],[44,9,44,10],[45,9,45,10],[46,9,46,10],[43,2,43,3],[44,2,44,3],[45,2,45,3],[46,2,46,3],[34,9,34,10],[35,9,35,10],[36,9,36,10],[37,9,37,10],[38,9,38,10],[34,2,34,3],[35,2,35,3],[36,2,36,3],[37,2,37,3],[38,2,38,3],[21,1,21,13],[23,1,23,13],[24,1,24,13],[26,1,26,13],[33,2,33,3],[33,9,33,10],[15,1,15,13],[14,1,14,13],[17,1,17,13],[18,1,18,13],[20,1,20,13],[0,1,0,13],[12,1,12,13],[11,1,11,13],[9,12,10,12],[9,13,10,13],[4,2,4,5],[9,1,9,3],[9,4,10,4],[9,5,10,5],[9,6,10,6],[9,7,10,7],[9,8,10,8],[9,9,10,9],[9,10,10,10],[9,11,10,11],[1,12,1,13]]}
[]
[null,null,"KERROSTALOJEN KORJAUSTOIMINNAN ENERGIATALOUDELLISTEN VALINTOJEN VERTAILU"]
[null,null,null,null,null,"Rakenne- ja LVIS-teknisten energiansäästötoimenpiteiden valinta rakenne- ja laitetasolla"]
[]
[null,null,"Yhteenveto valinnoista"]
[]
[]
[]
[]
[null,"VALINTAJÄRJESTYS",null,null,"VALINNAN\nSISÄINEN\nKORKO [%]","TOIMEN-\nPITEEN\nTUNNUS","HARKITTAVA\nENERGIANSÄÄSTÖTOIMENPIDE","RAKENNUS-\nKUSTANNUSERO\n[€]","LÄMMITYSENERGIAN \nKULUTUKSEN\nMUUTOS\n[MWh/a]","SÄHKÖENERGIAN\nKULUTUKSEN\nMUUTOS [MWh/a]","KUSTANNUSTEN VUOSIMUUTOS\n[€/a]","PITOAIKA\n[a]","TAKAISIN-\nMAKSUAIKA\n[a]","TAKAISIN-\nMAKSU-\nKERRAT\nPITOAIKANA"]
[null,"TAKAISIN-\nMAKSU-\nAJAN\nMUKAAN","TAKAISIN-\nMAKSU-\nKERTOJEN\nMUKAAN","SISÄISEN\nKORON\nMUKAAN"]
[]
[null,{"$f":"Lähtötiedot!C18","v":"YLÄPOHJA"}]
[null,5,3,4,0.11255324685591461,"YP1","ERISTYS 200 + 50 mm",2628,-6,0,-300,40,8.76,4.5662100456621006]
[]
{"$rows_left_out":54}
{"sheet":"Kuvaajat","index":5,"n_rows":5,"n_cols":5,"rows_kept":5,"cut":false,"hidden":false,"merged":[[4,2,4,3],[0,1,0,20]]}
[]
[null,null,"KERROSTALOJEN KORJAUSTOIMINNAN ENERGIATALOUDELLISTEN VALINTOJEN VERTAILU"]
[null,null,null,null,"Rakenne- ja LVIS-teknisten energiansäästötoimenpiteiden valinta rakenne- ja laitetasolla"]
[]
[null,null,"Kuvaajat"]

{"sheet":"Temp","index":6,"n_rows":128,"n_cols":13,"rows_kept":128,"cut":false,"hidden":false,"merged":[[0,0,0,2]]}
["MUIDEN KUIN PERUSRATKAISUJEN"]
["TAKAISINMAKSUAJAT","TAKAISINMAKSUKERRAT\nPITOAIKANA","SISÄISET\nKOROT"]
[{"$f":"'Toimenpiteiden valitseminen'!N22","v":8.76},{"$f":"'Toimenpiteiden valitseminen'!O22","v":4.5662100456621006},{"$f":"'Toimenpiteiden valitseminen'!F22","v":0.11255324685591461},"YP1"]
[{"$f":"'Toimenpiteiden valitseminen'!N24","v":27.04},{"$f":"'Toimenpiteiden valitseminen'!O24","v":1.4792899408284024},{"$f":"'Toimenpiteiden valitseminen'!F24","v":2.0663177460476936E-2},"YP2"]
[{"$f":"'Toimenpiteiden valitseminen'!N26","v":""},{"$f":"'Toimenpiteiden valitseminen'!O26","v":""},{"$f":"'Toimenpiteiden valitseminen'!F26","v":0},"YP3"]
[{"$f":"'Toimenpiteiden valitseminen'!N30","v":11.333333333333334},{"$f":"'Toimenpiteiden valitseminen'!O30","v":3.5294117647058822},{"$f":"'Toimenpiteiden valitseminen'!F30","v":8.4838772415913144E-2},"US1"]
[{"$f":"'Toimenpiteiden valitseminen'!N32","v":57.294117647058826},{"$f":"'Toimenpiteiden valitseminen'!O32","v":0.69815195071868585},{"$f":"'Toimenpiteiden valitseminen'!F32","v":-1.6494452522928145E-2},"US2"]
[{"$f":"'Toimenpiteiden valitseminen'!N34","v":""},{"$f":"'Toimenpiteiden valitseminen'!O34","v":""},{"$f":"'Toimenpiteiden valitseminen'!F34","v":0},"US3"]
[{"$f":"'Toimenpiteiden valitseminen'!N38","v":5.4521739130434783},{"$f":"'Toimenpiteiden valitseminen'!O38","v":5.5023923444976077},{"$f":"'Toimenpiteiden valitseminen'!F38","v":0.18220341625823658},"IKK1"]
[{"$f":"'Toimenpiteiden valitseminen'!N40","v":4.830222222222222},{"$f":"'Toimenpiteiden valitseminen'!O40","v":6.2108943687891056},{"$f":"'Toimenpiteiden valitseminen'!F40","v":0.20628414639059262},"IKK2"]
[{"$f":"'Toimenpiteiden valitseminen'!N42","v":""},{"$f":"'Toimenpiteiden valitseminen'!O42","v":""},{"$f":"'Toimenpiteiden valitseminen'!F42","v":0},"IKK3"]
[{"$f":"'Toimenpiteiden valitseminen'!N45","v":4.1390289201379673},{"$f":"'Toimenpiteiden valitseminen'!O45","v":3.6240384615384618},{"$f":"'Toimenpiteiden valitseminen'!F45","v":0.23089228481829616},"VKM"]
[{"$f":"'Toimenpiteiden valitseminen'!N48","v":8.6419753086419746},{"$f":"'Toimenpiteiden valitseminen'!O48","v":3.4714285714285715},{"$f":"'Toimenpiteiden valitseminen'!F48","v":0.11076264665508979},"IV1"]
[{"$f":"'Toimenpiteiden valitseminen'!N49","v":11.824324324324325},{"$f":"'Toimenpiteiden valitseminen'!O49","v":2.5371428571428569},{"$f":"'Toimenpiteiden valitseminen'!F49","v":7.4878886376319134E-2},"IV2"]
[{"$f":"'Toimenpiteiden valitseminen'!N50","v":""},{"$f":"'Toimenpiteiden valitseminen'!O50","v":""},{"$f":"'Toimenpiteiden valitseminen'!F50","v":0},"IV3"]
{"$rows_left_out":113}